{"text_format":"1","workbook":"xlsx","n_sheets":10,"sheets":["Serviceability","SMSF Serviceability Calculator","Member Serviceability Calc","HEM","Tables","Serviceability Calc","Tax Calc","User Problems","Version Control","Day and Months Table"],"not_rendered":{"charts":0,"images":1,"macros":1,"external_links":1,"defined_names":8,"comments":0,"pivot_tables":0},"unopened":[],"bounds":{"document_bytes":16777216,"sheet_cells":100000,"rows_first":2000,"rows_last":500,"rows_between":2000,"halvings":0,"cell_chars":16384,"cell_head_chars":4096},"cells_cut":0,"cells_raw":0,"read":"whole","date_system":"1900"}

{"sheet":"Serviceability","index":0,"n_rows":94,"n_cols":15,"rows_kept":94,"cut":false,"hidden":true,"merged":[[7,4,7,11],[17,8,17,10],[75,10,76,12],[75,13,76,13],[60,8,60,9],[61,8,61,9],[62,8,62,9],[63,8,63,9],[60,10,60,11],[61,10,61,11],[62,10,62,11],[63,10,63,11],[18,8,18,9],[19,8,19,9],[20,8,20,9],[21,8,21,9],[88,3,89,13],[75,3,76,9],[41,9,41,14],[43,9,43,14],[30,3,30,13],[59,10,59,11],[59,8,59,9],[66,8,66,9],[85,9,85,10],[81,13,82,13],[81,6,81,7],[82,6,82,7],[83,6,83,7],[84,6,84,7],[85,6,85,7]]}
[]
[]
[null,null,"Serviceability Calculator (Residential)"]
[null,null,null,"RedZed Lending Solutions Pty Ltd (ACL 311128)"]
[]
[null,null,null,"Information can be entered in the clear boxes, the grey boxes contain RedZed calculations."]
{"$rows_left_out":89}
{"sheet":"SMSF Serviceability Calculator","index":1,"n_rows":100,"n_cols":15,"rows_kept":100,"cut":false,"hidden":false,"merged":[[97,3,97,13],[66,6,66,9],[67,6,67,9],[71,5,71,11],[91,3,92,13],[54,10,54,11],[55,10,55,11],[56,10,56,11],[88,10,89,12],[88,13,89,13],[66,10,67,12],[66,13,67,13],[58,10,58,11],[57,10,57,11],[71,13,71,14],[60,8,60,9],[61,8,61,9],[59,10,59,11],[89,3,89,4],[85,3,88,5],[79,3,82,4],[60,10,60,11],[61,10,61,11],[66,3,68,5],[65,10,65,13],[64,3,64,14],[89,6,89,9],[88,6,88,9],[7,4,7,11],[28,3,28,13],[39,9,39,14],[53,10,53,11],[35,9,35,10],[10,3,10,5],[9,3,9,4],[26,3,27,5],[25,3,25,6]]}
[]
[]
[null,null,"SMSF Serviceability Calculator"]
[null,null,null,"RedZed Lending Solutions Pty Ltd (ACL 311128)"]
[]
[null,null,null,"Enter information in the pink boxes.The grey boxes contain calculated results."]
{"$rows_left_out":95}
{"sheet":"Member Serviceability Calc","index":2,"n_rows":214,"n_cols":18,"rows_kept":214,"cut":false,"hidden":true,"merged":[[205,3,206,16],[31,9,31,10],[32,9,32,10],[33,9,33,10],[34,9,34,10],[183,9,183,14],[183,16,183,17],[200,13,201,15],[200,16,201,16],[191,3,194,5],[202,13,203,16],[177,13,177,15],[178,16,179,16],[188,3,190,6],[178,3,180,8],[200,9,200,12],[131,12,131,14],[149,12,149,14],[167,12,167,14],[201,9,201,12],[178,13,179,15],[7,4,7,14],[22,11,22,12],[73,11,73,12],[74,11,74,12],[75,11,75,12],[30,9,30,10],[19,3,19,17],[20,3,20,17],[22,13,22,14],[17,3,17,17],[91,3,91,11],[92,3,92,11],[93,3,93,11],[94,3,94,11],[113,12,113,14]]}
[]
[]
[null,null,"SMSF Additional Member Contribution "]
[null,null,null,"RedZed Lending Solutions Pty Ltd (ACL 311128)"]
[]
[null,null,null,"Enter information in the Pink boxes. The grey boxes contain calculated results"]
{"$rows_left_out":209}
{"sheet":"HEM","index":3,"n_rows":56,"n_cols":18,"rows_kept":56,"cut":false,"hidden":true,"merged":[[18,3,18,4]]}
["Income Range ($)","Single Adult","Single Adult +1","Single Adult +2","Single Adult +3","Single Adult +4","Single Adult +5","Single Adult +6","Couple","Couple +1","Couple +2","Couple +3","Couple +4","Couple +5","Couple +6"]
["0 - 25,000",1280.4665353565058,1815.3643099216436,2293.6387059817694,2845.133044372013,3288.5145308035708,4023.6652441542055,4777.2437747893664,2529.1235269118683,3005.8870484628005,3290.6731003715431,3661.0570312023187,4292.8565530874548,4649.4113146519858,5005.9660762165167]
["25,001 - 38,000",1362.0323257293619,1815.3643099216436,2293.6387059817694,2845.133044372013,3288.5145308035708,4023.6652441542055,4777.2437747893664,2529.1235269118683,3005.8870484628005,3290.6731003715431,3661.0570312023187,4292.8565530874548,4649.4113146519858,5005.9660762165167]
["38,001 - 51,000",1434.1721243672337,1888.3291388934724,2366.7310916327428,2845.133044372013,3288.5145308035708,4023.6652441542055,4777.2437747893664,2602.0949950684949,3005.8870484628005,3290.6731003715431,3661.0570312023187,4292.8565530874548,4649.4113146519858,5005.9660762165167]
["51,001 - 64,000",1534.7486902157177,1990.0561454817555,2468.6355522422382,2947.2149590027216,3392.1793247156725,4023.6652441542055,4777.2437747893664,2703.831097615222,3108.604352696068,3392.4786884966161,3661.0570312023187,4292.8565530874548,4649.4113146519858,5005.9660762165167]
["64,001 - 76,000",1695.6993675814836,2152.8477019499865,2631.7113416083102,3110.5749812666345,3558.0720688396614,4023.6652441542055,4777.2437747893664,2866.6375068293296,3272.9806613397595,3555.3958769816049,3823.4633421504082,4292.8565530874548,4649.4113146519858,5005.9660762165167]
{"$rows_left_out":51}
{"sheet":"Tables","index":4,"n_rows":415,"n_cols":15,"rows_kept":415,"cut":false,"hidden":true,"merged":[[70,5,70,6],[70,1,70,2],[70,7,70,8],[329,1,329,2],[338,1,338,2]]}
[]
["Tax"]
[null,null,null,null,null,null,"Flood Levy"]
["Wages Over","Not to Exceed","Tax Rate",null,null,null,"Taxable income","Flood levy on this income"]
[0,18200,0,null,null,null,"$0 to $50,000","Nil",0,50000,0]
[{"$f":"B5+1","v":18201},45000,0.16,{"$f":"D5+C5*(B5-A5)","v":0},null,null,"$50,001 to $100,000","Half a cent for each $1 over $50,000",50001,100000,0,{"$f":"(J6-J5)*K6","v":0}]
{"$rows_left_out":410}
{"sheet":"Serviceability Calc","index":5,"n_rows":52,"n_cols":20,"rows_kept":52,"cut":false,"hidden":true,"merged":[[0,0,0,1]]}
["Serviceability Cell Calculation"]
[null,null,null,null,null,"Total Income Funding level",{"$f":"'SMSF Serviceability Calculator'!N30","v":0}]
[null,{"$f":"Serviceability!D50&\" (After Tax Rates Applied)\"","v":"Available Income (After Tax Rates Applied)"},{"$f":"Serviceability!N50","v":4915.6916666666666},null,null,{"$f":"'SMSF Serviceability Calculator'!D45&\" (After Tax Rates Applied)\"","v":"Available Income (After Tax Rates Applied)"},{"$f":"'SMSF Serviceability Calculator'!N45","v":0},null,null,"Household 1",{"$f":" IF(EXACT('Member Serviceability Calc'!E14,'Serviceability Calc'!J3),'Member Serviceability Calc'!Q14,0)+ IF(EXACT('Member Serviceability Calc'!E15,'Serviceability Calc'!J3),'Member Serviceability Calc'!Q15,0)+IF(EXACT('Member Serviceability Calc'!E16,'Serviceability Calc'!J3),'Member Serviceability Calc'!Q16,0)+ IF(EXACT('Member Serviceability Calc'!E17,'Serviceability Calc'!J3),'Member Serviceability Calc'!Q17,0)","v":4105},{"$f":"IF(EXACT('Member Serviceability Calc'!E14,'Serviceability Calc'!J3),IF(EXACT('Member Serviceability Calc'!G14,\"Alt Doc\"),1,0),0)+ IF(EXACT('Member Serviceability Calc'!E15,'Serviceability Calc'!J3),IF(EXACT('Member Serviceability Calc'!G15,\"Alt Doc\"),1,0),0)+IF(EXACT('Member Serviceability Calc'!E16,'Serviceability Calc'!J3),IF(EXACT('Member Serviceability Calc'!G16,\"Alt Doc\"),1,0),0)+ IF(EXACT('Member Serviceability Calc'!E17,'Serviceability Calc'!J3),IF(EXACT('Member Serviceability Calc'!G17,\"Alt Doc\"),1,0),0)","v":0},{"$f":"IF(P3>0,Q3,0)","v":0},{"$f":"Tables!B374","v":0},{"$f":"M3/M7*M11","v":{"$error":"#DIV/0!"}},{"$f":"IF('Member Serviceability Calc'!G14 = \"Alt Doc\",1,0)","v":0},{"$f":"'Member Serviceability Calc'!Q14","v":4105},{"$f":"IF(S3>0,N3*K45,0)","v":0},{"$f":"IF(Tables!B370,1,0)","v":0},{"$f":" IF(EXACT('Member Serviceability Calc'!E14,'Serviceability Calc'!J3),'Member Serviceability Calc'!O14,0)+ IF(EXACT('Member Serviceability Calc'!E15,'Serviceability Calc'!J3),'Member Serviceability Calc'!O15,0)+IF(EXACT('Member Serviceability Calc'!E16,'Serviceability Calc'!J3),'Member Serviceability Calc'!O16,0)+ IF(EXACT('Member Serviceability Calc'!E17,'Serviceability Calc'!J3),'Member Serviceability Calc'!O17,0)","v":6100}]
[null,"Divided by",null,null,null,"Divided by",null,null,null,"Household 2",{"$f":" IF(EXACT('Member Serviceability Calc'!E14,'Serviceability Calc'!J4),'Member Serviceability Calc'!Q14,0)+ IF(EXACT('Member Serviceability Calc'!E15,'Serviceability Calc'!J4),'Member Serviceability Calc'!Q15,0)+IF(EXACT('Member Serviceability Calc'!E16,'Serviceability Calc'!J4),'Member Serviceability Calc'!Q16,0)+ IF(EXACT('Member Serviceability Calc'!E17,'Serviceability Calc'!J4),'Member Serviceability Calc'!Q17,0)","v":0},{"$f":"IF(EXACT('Member Serviceability Calc'!E14,'Serviceability Calc'!J4),IF(EXACT('Member Serviceability Calc'!G14,\"Alt Doc\"),1,0),0)+ IF(EXACT('Member Serviceability Calc'!E15,'Serviceability Calc'!J4),IF(EXACT('Member Serviceability Calc'!G15,\"Alt Doc\"),1,0),0)+IF(EXACT('Member Serviceability Calc'!E16,'Serviceability Calc'!J4),IF(EXACT('Member Serviceability Calc'!G16,\"Alt Doc\"),1,0),0)+ IF(EXACT('Member Serviceability Calc'!E17,'Serviceability Calc'!J4),IF(EXACT('Member Serviceability Calc'!G17,\"Alt Doc\"),1,0),0)","v":0},{"$f":"IF(P4>0,Q4,0)","v":0},{"$f":"Tables!C374","v":0},{"$f":"M4/M7*M11","v":{"$error":"#DIV/0!"}},{"$f":"IF('Member Serviceability Calc'!G15 = \"Alt Doc\",1,0)","v":0},{"$f":"'Member Serviceability Calc'!Q15","v":0},{"$f":"IF(S4>0,N4*L45,0)","v":0},{"$f":"IF(Tables!C370,1,0)","v":0},{"$f":" IF(EXACT('Member Serviceability Calc'!E14,'Serviceability Calc'!J4),'Member Serviceability Calc'!O14,0)+ IF(EXACT('Member Serviceability Calc'!E15,'Serviceability Calc'!J4),'Member Serviceability Calc'!O15,0)+IF(EXACT('Member Serviceability Calc'!E16,'Serviceability Calc'!J4),'Member Serviceability Calc'!O16,0)+ IF(EXACT('Member Serviceability Calc'!E17,'Serviceability Calc'!J4),'Member Serviceability Calc'!O17,0)","v":0}]
[null,{"$f":"Serviceability!D73","v":"Total Monthly Commitments"},{"$f":"SUM(Serviceability!N56:N72)","v":0},null,null,"Total Monthly Commitments (Before Buffering)",{"$f":"SUM('SMSF Serviceability Calculator'!N51,'SMSF Serviceability Calculator'!N55:'SMSF Serviceability Calculator'!N57,'SMSF Serviceability Calculator'!N60)","v":0},null,null,"Household 3",{"$f":" IF(EXACT('Member Serviceability Calc'!E14,'Serviceability Calc'!J5),'Member Serviceability Calc'!Q14,0)+ IF(EXACT('Member Serviceability Calc'!E15,'Serviceability Calc'!J5),'Member Serviceability Calc'!Q15,0)+IF(EXACT('Member Serviceability Calc'!E16,'Serviceability Calc'!J5),'Member Serviceability Calc'!Q16,0)+ IF(EXACT('Member Serviceability Calc'!E17,'Serviceability Calc'!J5),'Member Serviceability Calc'!Q17,0)","v":0},{"$f":"IF(EXACT('Member Serviceability Calc'!E14,'Serviceability Calc'!J5),IF(EXACT('Member Serviceability Calc'!G14,\"Alt Doc\"),1,0),0)+ IF(EXACT('Member Serviceability Calc'!E15,'Serviceability Calc'!J5),IF(EXACT('Member Serviceability Calc'!G15,\"Alt Doc\"),1,0),0)+IF(EXACT('Member Serviceability Calc'!E16,'Serviceability Calc'!J5),IF(EXACT('Member Serviceability Calc'!G16,\"Alt Doc\"),1,0),0)+ IF(EXACT('Member Serviceability Calc'!E17,'Serviceability Calc'!J5),IF(EXACT('Member Serviceability Calc'!G17,\"Alt Doc\"),1,0),0)","v":0},{"$f":"IF(P5>0,Q5,0)","v":0},{"$f":"Tables!D374","v":0},{"$f":"M5/M7*M11","v":{"$error":"#DIV/0!"}},{"$f":"IF('Member Serviceability Calc'!G16 = \"Alt Doc\",1,0)","v":0},{"$f":"'Member Serviceability Calc'!Q16","v":0},{"$f":"IF(S5>0,N5*M45,0)","v":0},{"$f":"IF(Tables!D370,1,0)","v":0},{"$f":" IF(EXACT('Member Serviceability Calc'!E14,'Serviceability Calc'!J5),'Member Serviceability Calc'!O14,0)+ IF(EXACT('Member Serviceability Calc'!E15,'Serviceability Calc'!J5),'Member Serviceability Calc'!O15,0)+IF(EXACT('Member Serviceability Calc'!E16,'Serviceability Calc'!J5),'Member Serviceability Calc'!O16,0)+ IF(EXACT('Member Serviceability Calc'!E17,'Serviceability Calc'!J5),'Member Serviceability Calc'!O17,0)","v":0}]
["Less",{"$f":"Serviceability!$D$54&\" - \"&Serviceability!E56","v":"RedZed Loan Applied For - Loan 1"},{"$f":"-Serviceability!N56","v":0},null,"Less",{"$f":"Serviceability!$D$54&\" - \"&'SMSF Serviceability Calculator'!E51","v":"RedZed Loan Applied For - New RedZed Loan "},{"$f":"-'SMSF Serviceability Calculator'!N51","v":0},null,null,"Household 4",{"$f":" IF(EXACT('Member Serviceability Calc'!E14,'Serviceability Calc'!J6),'Member Serviceability Calc'!Q14,0)+ IF(EXACT('Member Serviceability Calc'!E15,'Serviceability Calc'!J6),'Member Serviceability Calc'!Q15,0)+IF(EXACT('Member Serviceability Calc'!E16,'Serviceability Calc'!J6),'Member Serviceability Calc'!Q16,0)+ IF(EXACT('Member Serviceability Calc'!E17,'Serviceability Calc'!J6),'Member Serviceability Calc'!Q17,0)","v":0},{"$f":"IF(EXACT('Member Serviceability Calc'!E14,'Serviceability Calc'!J6),IF(EXACT('Member Serviceability Calc'!G14,\"Alt Doc\"),1,0),0)+ IF(EXACT('Member Serviceability Calc'!E15,'Serviceability Calc'!J6),IF(EXACT('Member Serviceability Calc'!G15,\"Alt Doc\"),1,0),0)+IF(EXACT('Member Serviceability Calc'!E16,'Serviceability Calc'!J6),IF(EXACT('Member Serviceability Calc'!G16,\"Alt Doc\"),1,0),0)+ IF(EXACT('Member Serviceability Calc'!E17,'Serviceability Calc'!J6),IF(EXACT('Member Serviceability Calc'!G17,\"Alt Doc\"),1,0),0)","v":0},{"$f":"IF(P6>0,Q6,0)","v":0},{"$f":"Tables!E374","v":0},{"$f":"M6/M7*M11","v":{"$error":"#DIV/0!"}},{"$f":"IF('Member Serviceability Calc'!G17 = \"Alt Doc\",1,0)","v":0},{"$f":"'Member Serviceability Calc'!Q17","v":0},{"$f":"IF(S6>0,N6*N45,0)","v":0},{"$f":"IF(Tables!E370,1,0)","v":0},{"$f":" IF(EXACT('Member Serviceability Calc'!E14,'Serviceability Calc'!J6),'Member Serviceability Calc'!O14,0)+ IF(EXACT('Member Serviceability Calc'!E15,'Serviceability Calc'!J6),'Member Serviceability Calc'!O15,0)+IF(EXACT('Member Serviceability Calc'!E16,'Serviceability Calc'!J6),'Member Serviceability Calc'!O16,0)+ IF(EXACT('Member Serviceability Calc'!E17,'Serviceability Calc'!J6),'Member Serviceability Calc'!O17,0)","v":0}]
{"$rows_left_out":47}
{"sheet":"Tax Calc","index":6,"n_rows":54,"n_cols":19,"rows_kept":54,"cut":false,"hidden":true,"merged":[]}
["Tax Calc"]
[]
["Annual Gross",null,null,"Gross","Tax","Medicare","Income offset","Net","Net Monthly"]
[]
["Applicant / G'Tor 1","Salary / Self Employed",null,{"$f":"'Member Serviceability Calc'!O14*12","v":73200},{"$f":"IF(D5<Tables!$A$6,0,IF(AND(D5>Tables!$A$6,D5<Tables!$A$7),(D5-Tables!$A$6)*Tables!$C$6,IF(AND(D5>Tables!$A$7,D5<Tables!$A$8),Tables!$D$7+(D5-Tables!$A$7)*Tables!$C$7,IF(AND(D5>Tables!$A$8,D5<Tables!$A$9),Tables!$D$8+(D5-Tables!$A$8)*Tables!$C$8,IF(D5>Tables!$A$9,Tables!$D$9+(D5-Tables!$A$9)*Tables!$C$9)))))","v":12747.699999999999},{"$f":"D5*Tables!C$16","v":1464},{"$f":"IFERROR(((D5-VLOOKUP(D5,$A$29:$D$33,1,TRUE))*VLOOKUP(D5,$A$29:$D$33,3,TRUE)+VLOOKUP(D5,$A$29:$D$33,4,TRUE)),0)+IFERROR((IF(D5>66667,66667-45001,(D5-VLOOKUP(D5,$A$41:$D$43,1,TRUE)))*VLOOKUP(D5,$A$41:$D$43,3,TRUE)+VLOOKUP(D5,$A$41:$D$43,4,TRUE)),0)","v":0},{"$f":"D5-E5-F5+G5","v":58988.3},{"$f":"H5/12","v":4915.6916666666666}]
["Applicant / G'Tor 2","Salary / Self Employed",null,{"$f":"'Member Serviceability Calc'!O15*12","v":0},{"$f":"IF(D6<Tables!$A$6,0,IF(AND(D6>=Tables!$A$6,D6<Tables!$A$7),(D6-Tables!$A$6)*Tables!$C$6,IF(AND(D6>=Tables!$A$7,D6<Tables!$A$8),Tables!$D$7+(D6-Tables!$A$7)*Tables!$C$7,IF(AND(D6>=Tables!$A$8,D6<Tables!$A$9),Tables!$D$8+(D6-Tables!$A$8)*Tables!$C$8,IF(D6>=Tables!$A$9,Tables!$D$9+(D6-Tables!$A$9)*Tables!$C$9)))))","v":0},{"$f":"D6*Tables!C$16","v":0},{"$f":"IFERROR(((D6-VLOOKUP(D6,$A$29:$D$33,1,TRUE))*VLOOKUP(D6,$A$29:$D$33,3,TRUE)+VLOOKUP(D6,$A$29:$D$33,4,TRUE)),0)+IFERROR((IF(D6>66667,66667-45001,(D6-VLOOKUP(D6,$A$41:$D$43,1,TRUE)))*VLOOKUP(D6,$A$41:$D$43,3,TRUE)+VLOOKUP(D6,$A$41:$D$43,4,TRUE)),0)","v":0},{"$f":"D6-E6-F6+G6","v":0},0]
{"$rows_left_out":49}
{"sheet":"User Problems","index":7,"n_rows":34,"n_cols":17,"rows_kept":34,"cut":false,"hidden":true,"merged":[]}
["#","Date","Submitted By","Sheet Name (if applicable)","Problem","Initial Review Assessment","Review Result Date","Review With User","Review Result or Action to Take","Sheets Affected","Development Version #","Type","Estimate (hrs)","Actual","Status","Date Unit Tested","Release Version #"]
[1,"2017-04-06","Bill Slattery",null,"What we are trying to achieve is a stress test of servicing capacity at the higher of;\n1. The selected interest rate + 2% or \n2. 7% \nThis change should only apply to Residential loans.\n",null,null,null,null,null,{"$f":"'Version Control'!C2","v":"V6.4 Test"},"Enhancement",null,null,"Completed","2017-04-10",{"$f":"'Version Control'!$C$9","v":"v6.5"}]
[2,"2017-04-10","Trevor Smith",null,"The tax table in the Residential calculator is not the same as in the Consolidated Calculator. Looks like the Residential Calculator was not updated for the 2017/2018 change to the upper limit for the 32.5% rate (ie from $80000 to $87000).","Change the tax table in the Residential Calculator in expectation you want it to match that in the Consolidated Calculator.","2017-04-10","Bill Slattery","Change as recommended",null,{"$f":"'Version Control'!C3","v":"V6.4 Test2  (v6.42)"},"Bug",null,null,"Completed","2017-04-10",{"$f":"'Version Control'!$C$9","v":"v6.5"}]
[3,"2017-04-24","Bill Slattery","Serviceability Calc","Add Serviceabilty Calculation Sheet as per Consolidated User Problem #131.","Name as \"Serviceability Calc\"",null,null,null,null,{"$f":"'Version Control'!$C$4","v":"V6.6 Test (v6.43)"},"Enhancement",null,null,"Completed","2017-05-01",{"$f":"'Version Control'!$C$9","v":"v6.5"}]
[4,"2017-04-24","Mario Lorenzi",null,"Add two macros:\n-Ctl/Shift/B to unhide the calculation sheets\n-Ctl/Shift/H to hide the calculation sheets\n",null,null,null,null,null,{"$f":"'Version Control'!$C$4","v":"V6.6 Test (v6.43)"},"Enhancement",null,null,"Completed","2017-05-01",{"$f":"'Version Control'!$C$9","v":"v6.5"}]
[5,"2017-04-24","Mario Lorenzi","Tables","Change Company Tax Rate to 28.5%","Set up a  a new Company Tax Table on Tables sheet. Change Company Income Calculation (Cell K18) to reference the new Company Tax Table.",null,null,null,null,{"$f":"'Version Control'!$C$4","v":"V6.6 Test (v6.43)"},"Data Maintenance",null,null,"Completed","2017-05-01",{"$f":"'Version Control'!$C$9","v":"v6.5"}]
{"$rows_left_out":29}
{"sheet":"Version Control","index":8,"n_rows":39,"n_cols":10,"rows_kept":39,"cut":false,"hidden":true,"merged":[]}
["Name","Date","Version #","Development Version File Name","Changes","Released Version",null,"Current Version",{"$f":"VLOOKUP($J$1,B2:$I$3984,8,FALSE)","v":"v1.4 240702"},{"$f":"MAX(B2:B3984)","v":"2024-07-02"}]
["Trevor Smith","2017-04-10","V6.4 Test","K:\\IT\\Change_Work Requests\\Work Request\\WR004 - Commercial Calculator\\02 Residential Calculator\\2017 05 Changes\\4. REDZED-Serviceability-170410-V6.4 Test2.xls","User Problem 1",null,{"$f":"IFERROR(VLOOKUP(MONTH(B2),'Day and Months Table'!A:B,2,FALSE)&VLOOKUP(DAY(B2),'Day and Months Table'!A:B,2,FALSE),\"N/A\")","v":"0410"},{"$f":"RIGHT(YEAR(B2),2)&G2","v":"170410"},{"$f":"CONCATENATE(C2,\" \",H2)","v":"V6.4 Test 170410"}]
["Trevor Smith","2017-04-10","V6.4 Test2  (v6.42)","K:\\IT\\Change_Work Requests\\Work Request\\WR004 - Commercial Calculator\\02 Residential Calculator\\2017 05 Changes\\4. REDZED-Serviceability-170410-V6.4 Test.xls","User Problem 2",null,{"$f":"IFERROR(VLOOKUP(MONTH(B3),'Day and Months Table'!A:B,2,FALSE)&VLOOKUP(DAY(B3),'Day and Months Table'!A:B,2,FALSE),\"N/A\")","v":"0410"},{"$f":"RIGHT(YEAR(B3),2)&G3","v":"170410"},{"$f":"CONCATENATE(C3,\" \",H3)","v":"V6.4 Test2  (v6.42) 170410"}]
["Trevor Smith","2017-05-01","V6.6 Test (v6.43)","K:\\IT\\Change_Work Requests\\Work Request\\WR004 - Commercial Calculator\\02 Residential Calculator\\2017 05 Changes\\4. REDZED-Serviceability-170410-V6.6 Test.xls","User Problems 3 - 14 inclusive",null,{"$f":"IFERROR(VLOOKUP(MONTH(B4),'Day and Months Table'!A:B,2,FALSE)&VLOOKUP(DAY(B4),'Day and Months Table'!A:B,2,FALSE),\"N/A\")","v":"0501"},"170501","V6.6 Test (v6.43) 170501"]
["Trevor Smith","2017-05-15","V6.8 Test (v6.44)","K:\\IT\\Change_Work Requests\\Work Request\\WR004 - Commercial Calculator\\02 Residential Calculator\\2017 05 Changes\\4. REDZED-Serviceability-170410-V6.8 Test.xls","User Problems 15 - 17 inclusive",null,{"$f":"IFERROR(VLOOKUP(MONTH(B5),'Day and Months Table'!A:B,2,FALSE)&VLOOKUP(DAY(B5),'Day and Months Table'!A:B,2,FALSE),\"N/A\")","v":"0515"},"170515","V6.8 Test (v6.44) 170515"]
["Trevor Smith","2017-06-21","V6.9 (v6.45)","K:\\IT\\Change_Work Requests\\Work Request\\WR004 - Commercial Calculator\\02 Residential Calculator\\2017 05 Changes\\4. REDZED-Serviceability-170410-V6.9.xls","User Problem 18 - 19","Issued to Mario Lorenzi for testing 20 June 2017",{"$f":"IFERROR(VLOOKUP(MONTH(B6),'Day and Months Table'!A:B,2,FALSE)&VLOOKUP(DAY(B6),'Day and Months Table'!A:B,2,FALSE),\"N/A\")","v":"0621"},"170621","V6.9 (v6.45) 170621"]
{"$rows_left_out":34}
{"sheet":"Day and Months Table","index":9,"n_rows":31,"n_cols":2,"rows_kept":31,"cut":false,"hidden":true,"merged":[]}
[1,"01"]
[2,"02"]
[3,"03"]
[4,"04"]
[5,"05"]
[6,"06"]
{"$rows_left_out":25}